Target
Bile acid receptor
Ligand
BDBM50015421
Substrate
Meas. Tech.
ChEMBL_1348160 (CHEMBL3269919)
IC50
7.5±n/a nM
Citation
 Yu, DDLin, WForman, BMChen, T Identification of trisubstituted-pyrazol carboxamide analogs as novel and potent antagonists of farnesoid X receptor. Bioorg Med Chem 22:2919-38 (2014)  
Target
Name:
Bile acid receptor
Synonyms:
BAR FXR HRR1 NR1H4_HUMAN RIP14 Retinoid X receptor-interacting protein 14 | farnesoid x receptor
Type:
Nuclear Receptor
Mol. Mass.:
55916.24
Organism:
Homo sapiens (Human)
Description:
Q96RI1
Residue:
486
  
Inhibitor
Name:
BDBM50015421
Synonyms:
CHEMBL3264644
Type:
Small organic molecule
Emp. Form.:
C30H32N4O5S
Mol. Mass.:
560.664
SMILES:
COc1cccc(Cn2cc(C(=O)Nc3ccc(C)c(c3)S(=O)(=O)N3CCOCC3)c(n2)-c2ccc(C)cc2)c1
: