Target
Integrase
Ligand
BDBM50021263
Substrate
Meas. Tech.
ChEMBL_1366288 (CHEMBL3297621)
Kd
24±n/a nM
Citation
 Fader, LDCarson, RMorin, SBilodeau, FChabot, CHalmos, TBailey, MDKawai, SHCoulombe, RLaplante, SMekhssian, KJakalian, AGarneau, MDuan, JMason, SWSimoneau, BFenwick, CTsantrizos, YYoakim, C Minimizing the Contribution of Enterohepatic Recirculation to Clearance in Rat for the NCINI Class of Inhibitors of HIV. ACS Med Chem Lett 5:711-6 (2014)  
Target
Name:
Integrase
Synonyms:
Human immunodeficiency virus type 1 integrase
Type:
PROTEIN
Mol. Mass.:
32231.48
Organism:
Human immunodeficiency virus 1
Description:
ChEMBL_90865
Residue:
288
  
Inhibitor
Name:
BDBM50021263
Synonyms:
CHEMBL3287908
Type:
Small organic molecule
Emp. Form.:
C25H27NO4
Mol. Mass.:
405.4862
SMILES:
Cc1nc2ccccc2c(-c2ccc3OCCCc3c2)c1[C@H](OC(C)(C)C)C(O)=O
: