Target
Sodium/nucleoside cotransporter 2
Ligand
BDBM50085528
Substrate
Meas. Tech.
ChEMBL_1477251 (CHEMBL3428943)
IC50
21000±n/a nM
Citation
 Tatani, KHiratochi, MNonaka, YIsaji, MShuto, S Identification of 8-aminoadenosine derivatives as a new class of human concentrative nucleoside transporter 2 inhibitors. ACS Med Chem Lett 6:244-8 (2015)  
Target
Name:
Sodium/nucleoside cotransporter 2
Synonyms:
CNT2 SLC28A2
Type:
PROTEIN
Mol. Mass.:
71934.06
Organism:
Homo sapiens (Human)
Description:
ChEMBL_1477251
Residue:
658
  
Inhibitor
Name:
BDBM50085528
Synonyms:
CHEMBL3427689
Type:
Small organic molecule
Emp. Form.:
C23H24N6O4
Mol. Mass.:
448.4745
SMILES:
Nc1ncnc2n([C@@H]3O[C@H](CO)[C@@H](O)[C@H]3O)c(NCc3cccc(c3)-c3ccccc3)nc12
: