Target
Sodium/nucleoside cotransporter 2
Ligand
BDBM32372
Substrate
Meas. Tech.
ChEMBL_1477251 (CHEMBL3428943)
IC50
52000±n/a nM
Citation
 Tatani, KHiratochi, MNonaka, YIsaji, MShuto, S Identification of 8-aminoadenosine derivatives as a new class of human concentrative nucleoside transporter 2 inhibitors. ACS Med Chem Lett 6:244-8 (2015)  
Target
Name:
Sodium/nucleoside cotransporter 2
Synonyms:
CNT2 SLC28A2
Type:
PROTEIN
Mol. Mass.:
71934.06
Organism:
Homo sapiens (Human)
Description:
ChEMBL_1477251
Residue:
658
  
Inhibitor
Name:
BDBM32372
Synonyms:
adenosine-derived inhibitor, 6
Type:
Small organic molecule
Emp. Form.:
C17H20N6O4
Mol. Mass.:
372.3785
SMILES:
Nc1ncnc2n([C@@H]3O[C@H](CO)[C@@H](O)[C@H]3O)c(NCc3ccccc3)nc12
: