Target
Sodium/nucleoside cotransporter 1
Ligand
BDBM50138530
Substrate
Meas. Tech.
ChEMBL_1494515 (CHEMBL3528992)
Ki
37000±n/a nM
Citation
 Lepist, EIDamaraju, VLZhang, JGati, WPYao, SYSmith, KMKarpinski, EYoung, JDLeung, KHCass, CE Transport of A1 adenosine receptor agonist tecadenoson by human and mouse nucleoside transporters: evidence for blood-brain barrier transport by murine equilibrative nucleoside transporter 1 mENT1. Drug Metab Dispos 41:916-22 (2013)  
Target
Name:
Sodium/nucleoside cotransporter 1
Synonyms:
CNT1 SLC28A1
Type:
PROTEIN
Mol. Mass.:
71589.29
Organism:
Homo sapiens (Human)
Description:
ChEMBL_1494515
Residue:
649
  
Inhibitor
Name:
BDBM50138530
Synonyms:
(2R,3R,5R)-2-Hydroxymethyl-5-{6-[(R)-(tetrahydro-furan-3-yl)amino]-purin-9-yl}-tetrahydro-furan-3,4-diol BDBM50224766 CVT-510 | Tecadenoson
Type:
Small organic molecule
Emp. Form.:
C14H19N5O5
Mol. Mass.:
337.3312
SMILES:
OC[C@H]1O[C@H]([C@H](O)[C@@H]1O)n1cnc2c(N[C@@H]3CCOC3)ncnc12
: