Target
Biotin--[biotin carboxyl-carrier protein] ligase
Ligand
BDBM50119454
Substrate
Meas. Tech.
ChEMBL_1515555 (CHEMBL3615835)
Kd
0.865000±n/a nM
Citation
 Bockman, MRKalinda, ASPetrelli, RDe la Mora-Rey, TTiwari, DLiu, FDawadi, SNandakumar, MRhee, KYSchnappinger, DFinzel, BCAldrich, CC Targeting Mycobacterium tuberculosis Biotin Protein Ligase (MtBPL) with Nucleoside-Based Bisubstrate Adenylation Inhibitors. J Med Chem 58:7349-69 (2015)  
Target
Name:
Biotin--[biotin carboxyl-carrier protein] ligase
Synonyms:
BirA bifunctional protein | birA
Type:
PROTEIN
Mol. Mass.:
28120.21
Organism:
Mycobacterium tuberculosis (strain CDC 1551 / Oshkosh)
Description:
ChEMBL_107988
Residue:
266
  
Inhibitor
Name:
BDBM50119454
Synonyms:
CHEMBL3140272
Type:
Small organic molecule
Emp. Form.:
C20H29N9O7S2
Mol. Mass.:
571.63
SMILES:
[H][C@]12CS[C@@H](CCCCC(=O)NS(=O)(=O)NC[C@H]3O[C@H]([C@H](O)[C@@H]3O)n3cnc4c(N)ncnc34)[C@@]1([H])NC(=O)N2
: