Target
Cytochrome P450 26A1
Ligand
BDBM50377963
Substrate
Meas. Tech.
ChEMBL_1517856 (CHEMBL3620652)
IC50
4.0±n/a nM
Citation
 Sun, BLiu, KHan, JZhao, LYSu, XLin, BZhao, DMCheng, MS Design, synthesis, and biological evaluation of amide imidazole derivatives as novel metabolic enzyme CYP26A1 inhibitors. Bioorg Med Chem 23:6763-73 (2015)  
Target
Name:
Cytochrome P450 26A1
Synonyms:
CP26A_HUMAN CYP26A1 Cytochrome P450 26A1 P450RAI1 | Retinoic acid 4-hydroxylase
Type:
Enzyme
Mol. Mass.:
56216.16
Organism:
Homo sapiens (Human)
Description:
O43174
Residue:
497
  
Inhibitor
Name:
BDBM50377963
Synonyms:
CHEMBL224305 | R-115866
Type:
Small organic molecule
Emp. Form.:
C21H23N5S
Mol. Mass.:
377.506
SMILES:
CCC(CC)[C@H](c1ccc(Nc2nc3ccccc3s2)cc1)n1cncn1
: