Target
Androgen receptor
Ligand
BDBM50367916
Substrate
Meas. Tech.
ChEMBL_1553953 (CHEMBL3767965)
Ki
0.400000±n/a nM
Citation
 Saeed, AVaught, GMGavardinas, KMatthews, DGreen, JELosada, PGBullock, HACalvert, NAPatel, NJSweetana, SAKrishnan, VHenck, JWLuz, JGWang, YJadhav, P 2-Chloro-4-[[(1R,2R)-2-hydroxy-2-methyl-cyclopentyl]amino]-3-methyl-benzonitrile: A Transdermal Selective Androgen Receptor Modulator (SARM) for Muscle Atrophy. J Med Chem 59:750-5 (2016)  
Target
Name:
Androgen receptor
Synonyms:
ANDR_HUMAN Androgen Receptor Androgen receptor/Baculoviral IAP repeat-containing protein 2 Dihydrotestosterone receptor Nuclear receptor subfamily 3 group C member 4
Type:
Receptor
Mol. Mass.:
99185.27
Organism:
Homo sapiens (Human)
Description:
CHO cells were stably transfected with human AR gene.
Residue:
920
  
Inhibitor
Name:
BDBM50367916
Synonyms:
METHYLTRIENOLONE R-1881
Type:
Small organic molecule
Emp. Form.:
C19H24O2
Mol. Mass.:
284.3927
SMILES:
C[C@]1(O)CC[C@H]2[C@@H]3CCC4=CC(=O)CCC4=C3C=C[C@]12C
: