Target
Sodium/nucleoside cotransporter 2
Ligand
BDBM50172410
Substrate
Meas. Tech.
ChEMBL_1579902 (CHEMBL3813158)
IC50
2700±n/a nM
Citation
 Tatani, KHiratochi, MKikuchi, NKuramochi, YWatanabe, SYamauchi, YItoh, FIsaji, MShuto, S Identification of Adenine and Benzimidazole Nucleosides as Potent Human Concentrative Nucleoside Transporter 2 Inhibitors: Potential Treatment for Hyperuricemia and Gout. J Med Chem 59:3719-31 (2016)  
Target
Name:
Sodium/nucleoside cotransporter 2
Synonyms:
CNT2 SLC28A2
Type:
PROTEIN
Mol. Mass.:
71934.06
Organism:
Homo sapiens (Human)
Description:
ChEMBL_1477251
Residue:
658
  
Inhibitor
Name:
BDBM50172410
Synonyms:
CHEMBL3808652
Type:
Small organic molecule
Emp. Form.:
C22H23N7O4
Mol. Mass.:
449.4625
SMILES:
Nc1ncnc2n([C@@H]3O[C@H](CO)[C@@H](O)[C@H]3O)c(NCc3ccc(cc3)-c3ccncc3)nc12
: