Target
Heat shock cognate 71 kDa protein
Ligand
BDBM32373
Substrate
Meas. Tech.
ChEMBL_1588265 (CHEMBL3825930)
Kd
3548±n/a nM
Citation
 Cheeseman, MDWestwood, IMBarbeau, ORowlands, MDobson, SJones, AMJeganathan, FBurke, RKadi, NWorkman, PCollins, Ivan Montfort, RLJones, K Exploiting Protein Conformational Change to Optimize Adenosine-Derived Inhibitors of HSP70. J Med Chem 59:4625-36 (2016)  
Target
Name:
Heat shock cognate 71 kDa protein
Synonyms:
HSC70 HSP7C_HUMAN HSPA8 heat shock 70kDa protein 8 isoform 2
Type:
Enzyme Catalytic Domain
Mol. Mass.:
70887.67
Organism:
Homo sapiens (Human)
Description:
gi_5729877
Residue:
646
  
Inhibitor
Name:
BDBM32373
Synonyms:
adenosine-derived inhibitor (Grp78), 8 | adenosine-derived inhibitor, 7
Type:
Small organic molecule
Emp. Form.:
C17H18Cl2N6O4
Mol. Mass.:
441.269
SMILES:
Nc1ncnc2n([C@@H]3O[C@H](CO)[C@@H](O)[C@H]3O)c(NCc3ccc(Cl)c(Cl)c3)nc12
: