Target
Atrial natriuretic peptide receptor 1/2/3
Ligand
BDBM50228173
Substrate
Meas. Tech.
ChEMBL_72643 (CHEMBL686062)
IC50
>100±n/a nM
Citation
 Bovy, PRO'Neal, JMOlins, GMPatton, DR Identification of structural requirements for analogues of atrial natriuretic peptide (ANP) to discriminate between ANP receptor subtypes. J Med Chem 32:869-74 (1989)  
Target
Name:
Atrial natriuretic peptide receptor 1/2/3
Synonyms:
Atrial natriuretic peptide receptor
Type:
Mol. Mass.:
Description:
ASSAY_ID of ChEMBL is 72643
Components:
This complex has 3 components.
Component 1
Name:
Atrial natriuretic peptide receptor 1
Synonyms:
ANP-A ANPRA_HUMAN Atrial natriuretic peptide receptor GC-A NPR-A | NPR1
Type:
PROTEIN
Mol. Mass.:
118919.35
Organism:
Homo sapiens (Human)
Description:
ChEMBL_700223
Residue:
1061
  
Component 2
Name:
Atrial natriuretic peptide receptor 2
Synonyms:
4.6.1.2 ANPR-B ANPRB_HUMAN Atrial natriuretic peptide receptor type B Guanylate cyclase B NPR2
Type:
PROTEIN
Mol. Mass.:
117026.24
Organism:
Homo sapiens (Human)
Description:
ChEMBL_105036
Residue:
1047
  
Component 3
Name:
Atrial natriuretic peptide receptor 3
Synonyms:
ANP-C ANPRC Atrial natriuretic peptide C-type receptor Atrial natriuretic peptide receptor C5orf23 NPR3 | NPRC
Type:
PROTEIN
Mol. Mass.:
59805.12
Organism:
Homo sapiens (Human)
Description:
ChEMBL_34991
Residue:
541
  
Inhibitor
Name:
BDBM50228173
Synonyms:
CHEMBL2371607
Type:
Small organic molecule
Emp. Form.:
C49H84N20O15S
Mol. Mass.:
1225.381
SMILES:
[#6]-[#6](-[#6])-[#6]-[#6@H](-[#7]-[#6](=O)-[#6@@H](-[#7])-[#6]-[#8])-[#6](=O)-[#7]-[#6@@H](-[#6]-[#6]-[#6]\[#7]=[#6](\[#7])-[#7])-[#6](=O)-[#7]-[#6@@H](-[#6]-[#6]-[#6]\[#7]=[#6](/[#7])-[#7])-[#6](=O)-[#7]-[#6@@H](-[#6]-[#8])-[#6](=O)-[#7]-[#6@@H](-[#6]-[#8])-[#6](=O)-[#7]-[#6@@H](-[#6]-[#16])-[#6](=O)-[#7]-[#6@@H](-[#6]-c1ccccc1)-[#6](=O)-[#7]-[#6]-[#6](=O)-[#7]-[#6]-[#6](=O)-[#7]-[#6@@H](-[#6]-[#6]-[#6]\[#7]=[#6](\[#7])-[#7])-[#6](-[#8])=O
: