Target
Sterol O-acyltransferase 1
Ligand
BDBM50229233
Substrate
Meas. Tech.
ChEMBL_28353 (CHEMBL644997)
IC50
5470±n/a nM
Citation
 Larsen, SDSpilman, CHBell, FPDinh, DMMartinborough, EWilson, GJ Synthesis and hypocholesterolemic activity of 6,7-dihydro-4H-pyrazolo[1,5-a]pyrrolo[3,4-d]pyrimidine-5,8-diones, novel inhibitors of acylCoA:cholesterol O-acyltransferase. J Med Chem 34:1721-7 (1991)  
Target
Name:
Sterol O-acyltransferase 1
Synonyms:
ACAT-1 Acat SOAT1_RAT Sterol O-acyltransferase, Soat
Type:
PROTEIN
Mol. Mass.:
64165.56
Organism:
Rattus norvegicus
Description:
ChEMBL_28796
Residue:
545
  
Inhibitor
Name:
BDBM50229233
Synonyms:
CHEMBL299604
Type:
Small organic molecule
Emp. Form.:
C29H22N4O3
Mol. Mass.:
474.51
SMILES:
O=C(Cn1c2C(=O)N(Cc3ccccc3)Cc2c(=O)n2nc(cc12)-c1ccccc1)c1ccccc1
: