Target
NADPH--cytochrome P450 reductase
Ligand
BDBM50236860
Substrate
Meas. Tech.
ChEMBL_1659516 (CHEMBL4009128)
IC50
25000±n/a nM
Citation
 Bian, JLi, XWang, NWu, XYou, QZhang, X Discovery of quinone-directed antitumor agents selectively bioactivated by NQO1 over CPR with improved safety profile. Eur J Med Chem 129:27-40 (2017)  
Target
Name:
NADPH--cytochrome P450 reductase
Synonyms:
CYPOR NADPH--cytochrome P450 reductase P450R | POR
Type:
Enzyme
Mol. Mass.:
76675.22
Organism:
Homo sapiens (Human)
Description:
P16435
Residue:
677
  
Inhibitor
Name:
BDBM50236860
Synonyms:
CHEMBL4065098
Type:
Small organic molecule
Emp. Form.:
C15H12O3
Mol. Mass.:
240.254
SMILES:
CCc1coc-2c1C(=O)C(=O)c1cc(C)ccc-21
: