Target
Acid ceramidase
Ligand
BDBM50238569
Substrate
Meas. Tech.
ChEMBL_1663372 (CHEMBL4013053)
IC50
2.4±n/a nM
Citation
 Ortega, JAArencibia, JMLa Sala, GBorgogno, MBauer, IBono, LBraccia, CArmirotti, AGirotto, SGanesan, ADe Vivo, M Pharmacophore Identification and Scaffold Exploration to Discover Novel, Potent, and Chemically Stable Inhibitors of Acid Ceramidase in Melanoma Cells. J Med Chem 60:5800-5815 (2017)  
Target
Name:
Acid ceramidase
Synonyms:
ASAH ASAH1_HUMAN Acid ceramidase (AC)
Type:
Enzyme
Mol. Mass.:
44662.65
Organism:
Homo sapiens (Human)
Description:
Q13510
Residue:
395
  
Inhibitor
Name:
BDBM50238569
Synonyms:
CHEMBL4075447
Type:
Small organic molecule
Emp. Form.:
C19H18N2O3
Mol. Mass.:
322.3578
SMILES:
O=C(NCCCCc1ccccc1)N1C(=O)c2ccccc2C1=O
: