Target
Acid ceramidase
Ligand
BDBM50238557
Substrate
Meas. Tech.
ChEMBL_1663372 (CHEMBL4013053)
IC50
1±n/a nM
Citation
 Ortega, JAArencibia, JMLa Sala, GBorgogno, MBauer, IBono, LBraccia, CArmirotti, AGirotto, SGanesan, ADe Vivo, M Pharmacophore Identification and Scaffold Exploration to Discover Novel, Potent, and Chemically Stable Inhibitors of Acid Ceramidase in Melanoma Cells. J Med Chem 60:5800-5815 (2017)  
Target
Name:
Acid ceramidase
Synonyms:
ASAH ASAH1_HUMAN Acid ceramidase (AC)
Type:
Enzyme
Mol. Mass.:
44662.65
Organism:
Homo sapiens (Human)
Description:
Q13510
Residue:
395
  
Inhibitor
Name:
BDBM50238557
Synonyms:
CHEMBL4103207
Type:
Small organic molecule
Emp. Form.:
C19H21N3O
Mol. Mass.:
307.3895
SMILES:
Cc1nc2ccccc2n1C(=O)NCCCCc1ccccc1
: