Target
Acid ceramidase
Ligand
BDBM50238556
Substrate
Meas. Tech.
ChEMBL_1663372 (CHEMBL4013053)
IC50
0.900000±n/a nM
Citation
 Ortega, JAArencibia, JMLa Sala, GBorgogno, MBauer, IBono, LBraccia, CArmirotti, AGirotto, SGanesan, ADe Vivo, M Pharmacophore Identification and Scaffold Exploration to Discover Novel, Potent, and Chemically Stable Inhibitors of Acid Ceramidase in Melanoma Cells. J Med Chem 60:5800-5815 (2017)  
Target
Name:
Acid ceramidase
Synonyms:
ASAH ASAH1_HUMAN Acid ceramidase (AC)
Type:
Enzyme
Mol. Mass.:
44662.65
Organism:
Homo sapiens (Human)
Description:
Q13510
Residue:
395
  
Inhibitor
Name:
BDBM50238556
Synonyms:
CHEMBL4093029
Type:
Small organic molecule
Emp. Form.:
C18H20N4O
Mol. Mass.:
308.3776
SMILES:
Nc1nc2ccccc2n1C(=O)NCCCCc1ccccc1
: