Target
Angiotensin-converting enzyme 2
Ligand
BDBM85548
Substrate
Ki
18.8±n/a nM
Comments
PDSP_313
Citation
 Handa, RKHarding, JWSimasko, SM Characterization and function of the bovine kidney epithelial angiotensin receptor subtype 4 using angiotensin IV and divalinal angiotensin IV as receptor ligands. J Pharmacol Exp Ther 291:1242-9 (1999) Target
Name:
Angiotensin-converting enzyme 2
Synonyms:
ACE2 Angiotensin IV
Type:
Enzyme Catalytic Domain
Mol. Mass.:
93046.63
Organism:
BOVINE
Description:
Angiotensin IV 0 BOVINE::Q58DD0
Residue:
804
  
Inhibitor
Name:
BDBM85548
Synonyms:
Ang(3-10)
Type:
Small organic molecule
Emp. Form.:
C51H69N11O11
Mol. Mass.:
1012.1607
SMILES:
CC[C@H](C)[C@H](NC(=O)[C@H](Cc1ccc(O)cc1)NC(=O)[C@@H](N)C(C)C)C(=O)O[C@@H](Cc1cnc[nH]1)C(=O)N1CCC[C@H]1C(=O)N[C@@H](Cc1ccccc1)C(=O)N[C@@H](C(=O)N[C@@H](CC(C)C)C(O)=O)c1cnc[nH]1
: