Target
Serine/threonine-protein kinase Chk1
Ligand
BDBM91866
Substrate
Meas. Tech.
Abbott Kinase Enzymatics_CHK1/289 CDC25c
IC50
5±n/a nM
Citation
 CSARdock, CD CHK1 in CSAR_FULL_RELEASE_3JULY2012 CSAR 1:0 (2012)  
Target
Name:
Serine/threonine-protein kinase Chk1
Synonyms:
CHEK1 CHK1 checkpoint homolog Checkpoint kinase-1 (CHK1)
Type:
Enzyme Catalytic Domain
Mol. Mass.:
54443.02
Organism:
Homo sapiens (Human)
Description:
gi_166295192
Residue:
476
  
Inhibitor
Name:
BDBM91866
Synonyms:
Chk1_143
Type:
Emp. Form.:
C27H22N4O5S
Mol. Mass.:
514.552
SMILES:
COc1cc(ccc1[N+]([O-])=O)-c1ccc2c(Nc3cc(CC(=O)NCc4cccs4)ccc3NC2=O)c1
: