Target
Serine/threonine-protein kinase Chk1
Ligand
BDBM91859
Substrate
Meas. Tech.
Abbott Kinase Enzymatics_CHK1/289 CDC25c
IC50
5±n/a nM
Citation
 CSARdock, CD CHK1 in CSAR_FULL_RELEASE_3JULY2012 CSAR 1:0 (2012)  
Target
Name:
Serine/threonine-protein kinase Chk1
Synonyms:
CHEK1 CHK1 checkpoint homolog Checkpoint kinase-1 (CHK1)
Type:
Enzyme Catalytic Domain
Mol. Mass.:
54443.02
Organism:
Homo sapiens (Human)
Description:
gi_166295192
Residue:
476
  
Inhibitor
Name:
BDBM91859
Synonyms:
Chk1_136
Type:
Emp. Form.:
C27H22N4O6
Mol. Mass.:
498.4868
SMILES:
COc1cc2NC(=O)c3ccc(cc3Nc2cc1OCc1ccncc1)-c1ccc(c(OC)c1)[N+]([O-])=O
: