Target
Serine/threonine-protein kinase Chk1
Ligand
BDBM50214559
Substrate
Meas. Tech.
Abbott Kinase Enzymatics_CHK1/289 CDC25c
IC50
5±n/a nM
Citation
 CSARdock, CD CHK1 in CSAR_FULL_RELEASE_3JULY2012 CSAR 1:0 (2012)  
Target
Name:
Serine/threonine-protein kinase Chk1
Synonyms:
CHEK1 CHK1 checkpoint homolog Checkpoint kinase-1 (CHK1)
Type:
Enzyme Catalytic Domain
Mol. Mass.:
54443.02
Organism:
Homo sapiens (Human)
Description:
gi_166295192
Residue:
476
  
Inhibitor
Name:
BDBM50214559
Synonyms:
3-(4'-hydroxy-biphenyl-4-yl)-6-methoxy-2,4-dihydro-indeno[1,2-c]pyrazol-7-ol Chk1_130
Type:
Small organic molecule
Emp. Form.:
C23H18N2O3
Mol. Mass.:
370.4006
SMILES:
COc1cc2Cc3c(n[nH]c3-c2cc1O)-c1ccc(cc1)-c1ccc(O)cc1
: