Target
Serine/threonine-protein kinase Chk1
Ligand
BDBM50221589
Substrate
Meas. Tech.
Abbott Kinase Enzymatics_CHK1/289 CDC25c
IC50
5±n/a nM
Citation
 CSARdock, CD CHK1 in CSAR_FULL_RELEASE_3JULY2012 CSAR 1:0 (2012)  
Target
Name:
Serine/threonine-protein kinase Chk1
Synonyms:
CHEK1 CHK1 checkpoint homolog Checkpoint kinase-1 (CHK1)
Type:
Enzyme Catalytic Domain
Mol. Mass.:
54443.02
Organism:
Homo sapiens (Human)
Description:
gi_166295192
Residue:
476
  
Inhibitor
Name:
BDBM50221589
Synonyms:
4-((6,7-dimethoxy-1,4-dihydroindeno[1,2-c]pyrazol-3-yl)ethynyl)-2-methoxyphenol CHEMBL248396 | Chk1_146
Type:
Small organic molecule
Emp. Form.:
C21H18N2O4
Mol. Mass.:
362.3786
SMILES:
COc1cc2Cc3c(n[nH]c3C#Cc3ccc(O)c(OC)c3)-c2cc1OC
: