Target
Mitogen-activated protein kinase 1
Ligand
BDBM92151
Substrate
Meas. Tech.
Assay 1
Ki
3±n/a nM
Citation
 CSARdock, CD ERK2 in CSAR_FULL_RELEASE_3JULY2012 CSAR 1:0 (2012)  
Target
Name:
Mitogen-activated protein kinase 1
Synonyms:
ERK2 Extracellular signal-regulated kinase 2 Extracellular signal-regulated kinase 2 (ERK2) MAPK 2 MK01_HUMAN Mitogen-activated protein kinase 1 (ERK-2) Mitogen-activated protein kinase 2 PRKM2 | p42-MAPK
Type:
Ser/Thr Protein Kinase
Mol. Mass.:
41392.76
Organism:
Homo sapiens (Human)
Description:
P28482
Residue:
360
  
Inhibitor
Name:
BDBM92151
Synonyms:
erk000602
Type:
Emp. Form.:
C24H29N5O3
Mol. Mass.:
435.5188
SMILES:
Cc1cccc(c1)[C@@H](CO)NC(=O)c1cc(c[nH]1)-c1nc(NC2CCOCC2)ncc1C
: