Target
Mitogen-activated protein kinase 1
Ligand
BDBM35655
Substrate
Meas. Tech.
Assay 1
Ki
34±n/a nM
Citation
 CSARdock, CD ERK2 in CSAR_FULL_RELEASE_3JULY2012 CSAR 1:0 (2012)  
Target
Name:
Mitogen-activated protein kinase 1
Synonyms:
ERK2 Extracellular signal-regulated kinase 2 Extracellular signal-regulated kinase 2 (ERK2) MAPK 2 MK01_HUMAN Mitogen-activated protein kinase 1 (ERK-2) Mitogen-activated protein kinase 2 PRKM2 | p42-MAPK
Type:
Ser/Thr Protein Kinase
Mol. Mass.:
41392.76
Organism:
Homo sapiens (Human)
Description:
P28482
Residue:
360
  
Inhibitor
Name:
BDBM35655
Synonyms:
erk000598 | pyrimidylpyrrole, 11c
Type:
Small organic molecule
Emp. Form.:
C25H23ClFN5O2
Mol. Mass.:
479.934
SMILES:
Cc1cnc(Nc2cccc(F)c2C)nc1-c1c[nH]c(c1)C(=O)N[C@H](CO)c1cccc(Cl)c1
: