Target
Mitogen-activated protein kinase 1
Ligand
BDBM92096
Substrate
Meas. Tech.
Assay 1
Ki
3±n/a nM
Citation
 CSARdock, CD ERK2 in CSAR_FULL_RELEASE_3JULY2012 CSAR 1:0 (2012)  
Target
Name:
Mitogen-activated protein kinase 1
Synonyms:
ERK2 Extracellular signal-regulated kinase 2 Extracellular signal-regulated kinase 2 (ERK2) MAPK 2 MK01_HUMAN Mitogen-activated protein kinase 1 (ERK-2) Mitogen-activated protein kinase 2 PRKM2 | p42-MAPK
Type:
Ser/Thr Protein Kinase
Mol. Mass.:
41392.76
Organism:
Homo sapiens (Human)
Description:
P28482
Residue:
360
  
Inhibitor
Name:
BDBM92096
Synonyms:
erk000525
Type:
Emp. Form.:
C22H26ClN5O2
Mol. Mass.:
427.927
SMILES:
CC(C)CNc1ncc(C)c(n1)-c1c[nH]c(c1)C(=O)N[C@H](CO)c1cccc(Cl)c1
: