Target
Mitogen-activated protein kinase 1
Ligand
BDBM92210
Substrate
Meas. Tech.
Assay 1
Ki
2±n/a nM
Citation
 CSARdock, CD ERK2 in CSAR_FULL_RELEASE_3JULY2012 CSAR 1:0 (2012)  
Target
Name:
Mitogen-activated protein kinase 1
Synonyms:
ERK2 Extracellular signal-regulated kinase 2 Extracellular signal-regulated kinase 2 (ERK2) MAPK 2 MK01_HUMAN Mitogen-activated protein kinase 1 (ERK-2) Mitogen-activated protein kinase 2 PRKM2 | p42-MAPK
Type:
Ser/Thr Protein Kinase
Mol. Mass.:
41392.76
Organism:
Homo sapiens (Human)
Description:
P28482
Residue:
360
  
Inhibitor
Name:
BDBM92210
Synonyms:
erk000671
Type:
Emp. Form.:
C22H19ClN6O2
Mol. Mass.:
434.878
SMILES:
OC[C@@H](NC(=O)c1cc(c[nH]1)-c1ncnc(Nc2ccccc2)n1)c1cccc(Cl)c1
: