Target
Acid phosphatase
Ligand
BDBM59083
Substrate
Meas. Tech.
Inhibitor Screening Assay
Ki
5.9e+2± 2.3e+2 nM
Citation
 McRae, SPagliai, FAMohapatra, NPGener, AMahmou, ASGunn, JSLorca, GLGonzalez, CF Inhibition of AcpA phosphatase activity with ascorbate attenuates Francisella tularensis intramacrophage survival. J Biol Chem 285:5171-7 (2010)  
Target
Name:
Acid phosphatase
Synonyms:
Acid phosphatase (acpA) Acid phosphatase (acpC)
Type:
Enzyme
Mol. Mass.:
22350.38
Organism:
Francisella tularensis
Description:
Q5NIC0
Residue:
194
  
Inhibitor
Name:
BDBM59083
Synonyms:
MLS002154065 THONZONIUM BROMIDE cid_11102
Type:
Small organic molecule
Emp. Form.:
C32H55N4O
Mol. Mass.:
511.8048
SMILES:
CCCCCCCCCCCCCCCC[N+](C)(C)CCN(Cc1ccc(OC)cc1)c1ncccn1
: