Target
Lysine-specific demethylase 5A
Ligand
BDBM281237
Substrate
Meas. Tech.
KDM5 Enzyme Assay
pH
7±n/a
Temperature
298.15±n/a K
IC50
0.078±n/a nM
Comments
extracted
Citation
 Lai, KWLiang, JZhang, BLabadie, SOrtwine, DDragovich, PKiefer, JGehling, VSHarmange, J Pyrrolidine amide compounds as histone demethylase inhibitors US Patent  US10022354 Publication Date 7/17/2018 
Target
Name:
Lysine-specific demethylase 5A
Synonyms:
Histone demethylase JARID1A Jumonji/ARID domain-containing protein 1A KDM5A_HUMAN RBBP-2 RBP2 | Retinoblastoma-binding protein 2
Type:
Protein
Mol. Mass.:
192091.79
Organism:
Homo sapiens (Human)
Description:
P29375
Residue:
1690
  
Inhibitor
Name:
BDBM281237
Synonyms:
US10022354, Example 177
Type:
Small organic molecule
Emp. Form.:
C19H22N6O2
Mol. Mass.:
366.417
SMILES:
CC(C)c1cc([nH]n1)C(=O)N1CCC(C1)NC(=O)c1ccc2[nH]ccc2n1
: