Target
Ribonuclease pancreatic
Ligand
BDBM173613
Substrate
Meas. Tech.
Ribonuclease Activity Assay
Temperature
303.15±n/a K
Ki
1.061e+5± 6.9e+3 nM
Comments
extracted
Citation
 Chatzileontiadou, DSParmenopoulou, VManta, SKantsadi, ALKylindri, PGriniezaki, MKontopoulou, FTelopoulou, AProkova, HPanagopoulos, DBoix, EBalatsos, NAKomiotis, DLeonidas, DD Triazole double-headed ribonucleosides as inhibitors of eosinophil derived neurotoxin. Bioorg Chem 63:152-65 (2015)  
Target
Name:
Ribonuclease pancreatic
Synonyms:
CAM-RNase A RNASE1 RNS1
Type:
Enzyme
Mol. Mass.:
16468.79
Organism:
Bison bison (American bison)
Description:
carboxamidomethylated RNase A
Residue:
150
  
Inhibitor
Name:
BDBM173613
Synonyms:
9-[3'-[4-[(Uracil-1-yl)methyl]-1,2,3-triazol-1-yl]-b-D-ribofuranosyl]adenine (12a)
Type:
Small organic molecule
Emp. Form.:
C17H20N10O5
Mol. Mass.:
444.4047
SMILES:
NC1=NC=NC2C1N=CN2[C@@H]1O[C@H](CO)[C@@H](C1O)n1cc(Cn2ccc(=O)[nH]c2=O)nn1
: