Target
Tyrosine-protein kinase JAK1 [837-1142]
Ligand
BDBM197717
Substrate
Meas. Tech.
Kinase Assay
pH
7.8±n/a
Temperature
298.15±n/a K
IC50
1.8±0 nM
Comments
extracted
Citation
 Li, YRodgers, JD 3-[4-(7H-pyrrolo[2,3-D]pyrimidin-4-yl)-1H-pyrazol-1-yl]octane—or heptane-nitrile as JAK inhibitors US Patent  US9216984 Publication Date 12/22/2015 
Target
Name:
Tyrosine-protein kinase JAK1 [837-1142]
Synonyms:
JAK1 JAK1A JAK1_HUMAN Tyrosine-protein kinase JAK1 (837-1142) | Tyrosine-protein kinase JAK1 (aa 837-1142)
Type:
Mol. Mass.:
35230.04
Organism:
Homo sapiens (Human)
Description:
P23458[837-1142]
Residue:
306
  
Inhibitor
Name:
BDBM197717
Synonyms:
US9216984, 2
Type:
Small organic molecule
Emp. Form.:
C16H18N6
Mol. Mass.:
294.3543
SMILES:
CCCCC(CC#N)n1cc(cn1)-c1ncnc2[nH]ccc12
: