Target
Tyrosine-protein kinase JAK2 [828-1132]
Ligand
BDBM197716
Substrate
Meas. Tech.
Kinase Assay
pH
7.8±n/a
Temperature
298.15±n/a K
IC50
2.2±0 nM
Comments
extracted
Citation
 Li, YRodgers, JD 3-[4-(7H-pyrrolo[2,3-D]pyrimidin-4-yl)-1H-pyrazol-1-yl]octane—or heptane-nitrile as JAK inhibitors US Patent  US9216984 Publication Date 12/22/2015 
Target
Name:
Tyrosine-protein kinase JAK2 [828-1132]
Synonyms:
JAK2 JAK2_HUMAN | Tyrosine-protein kinase JAK2
Type:
Mol. Mass.:
35579.28
Organism:
Homo sapiens (Human)
Description:
O60674[828-1132]
Residue:
305
  
Inhibitor
Name:
BDBM197716
Synonyms:
US9216984, 1
Type:
Small organic molecule
Emp. Form.:
C17H20N6
Mol. Mass.:
308.3809
SMILES:
CCCCCC(CC#N)n1cc(cn1)-c1ncnc2[nH]ccc12
: