Target
Tyrosine-protein kinase JAK1 [852-1142]
Ligand
BDBM185701
Substrate
Meas. Tech.
JAK Enzymatic Assay
pH
7.4±n/a
IC50
45±n/a nM
Comments
extracted
Citation
 Mitton-Fry, MJBerlinski, PJBirchmeier, MJBowman, JWGonzales, AJKamerling, SGMann, DW Pyrrolo[2,3-D]pyrimidine compounds US Patent  US9271981 Publication Date 3/1/2016 
Target
Name:
Tyrosine-protein kinase JAK1 [852-1142]
Synonyms:
JAK1 JAK1B Tyrosine-protein kinase JAK1
Type:
Protein
Mol. Mass.:
33337.85
Organism:
Homo sapiens (Human)
Description:
JAK1 truncation (852-1142 aa)
Residue:
291
  
Inhibitor
Name:
BDBM185701
Synonyms:
US9161939, 2 | US9271981, 2
Type:
Small organic molecule
Emp. Form.:
C18H27N5O2S
Mol. Mass.:
377.504
SMILES:
CN([C@H]1CC[C@H](CS(=O)(=O)NC2CCC2)CC1)c1ncnc2[nH]ccc12
: