Target
5'-AMP-activated protein kinase catalytic subunit alpha-2/subunit beta-1/subunit gamma-1
Ligand
BDBM213198
Substrate
BDBM213211
Meas. Tech.
In Vitro AMPK Activation Assay
pH
7.3±n/a
EC50
2±n/a nM
Comments
extracted
Citation
 Apgar, JMArasappan, ABiftu, TChen, PFeng, DGuidry, EHicks, JDKekec, ALeavitt, KJLi, BMcCracken, TSebhat, IQian, XWei, LWilkening, RRWu, Z Azabenzimidazole hexahydrofuro[3,2-b]furan derivatives US Patent  US9290517 Publication Date 3/22/2016 
Target
Name:
5'-AMP-activated protein kinase catalytic subunit alpha-2/subunit beta-1/subunit gamma-1
Synonyms:
AMPK alpha2/beta1/gamma1 AMPK complex 7 (containing alpha-2, beta-1, gamma-1)
Type:
Mol. Mass.:
Description:
ASSAY_ID of ChEMBL is 1970361
Components:
This complex has 3 components.
Component 1
Name:
5'-AMP-activated protein kinase catalytic subunit alpha-2
Synonyms:
AAPK2_HUMAN AMP-activated protein kinase, alpha-2 subunit AMPK subunit alpha-2 AMPK2 Hydroxymethylglutaryl-CoA reductase kinase | PRKAA2
Type:
Enzyme
Mol. Mass.:
62331.02
Organism:
Homo sapiens (Human)
Description:
P54646
Residue:
552
  
Component 2
Name:
5'-AMP-activated protein kinase subunit gamma-1
Synonyms:
5'-AMP-activated protein kinase subunit gamma-1 AMP-activated protein kinase, gamma-1 subunit AMPK gamma-1 AMPK subunit gamma-1 PRKAG1
Type:
Mol. Mass.:
37581.44
Organism:
Homo sapiens (Human)
Description:
P54619
Residue:
331
  
Component 3
Name:
5'-AMP-activated protein kinase subunit beta-1
Synonyms:
5'-AMP-activated protein kinase subunit beta-1 AMP-activated protein kinase alpha-2/beta-1/gamma-3 AMPK subunit beta-1 PRKAB1
Type:
Mol. Mass.:
30380.94
Organism:
Homo sapiens (Human)
Description:
Q9Y478
Residue:
270
  
Inhibitor
Name:
BDBM213198
Synonyms:
US9290517, 128
Type:
Small organic molecule
Emp. Form.:
C28H22ClF3N6O6
Mol. Mass.:
630.959
SMILES:
O[C@@H]1CO[C@@H]2[C@@H](CO[C@H]12)Oc1nc2nc(c(Cl)cc2[nH]1)-c1ccc(cc1)-c1ccc(cc1)-n1cc(nn1)C(O)(O)C(F)(F)F
:
Substrate
Name:
BDBM213211
Synonyms:
US9290517, SAMS
Type:
Fluorescent Substrate
Emp. Form.:
C74H131N29O18S2
Mol. Mass.:
1779.145
SMILES:
CSCC[C@H](NC(=O)[C@H](C)NC(=O)[C@H](CO)NC(=O)[C@H](CCCN=C(N)N)NC(=O)[C@H](CCSC)NC(=O)[C@@H](N)Cc1cnc[nH]1)C(=O)N[C@@H](CO)C(=O)NCC(=O)N[C@@H](CC(C)C)C(=O)N[C@@H](Cc1cnc[nH]1)C(=O)N[C@@H](CC(C)C)C(=O)N[C@@H](C(C)C)C(=O)N[C@@H](CCCCN)C(=O)N[C@@H](CCCN=C(N)N)C(=O)N[C@@H](CCCN=C(N)N)C(O)=O
: