Target
Serine/threonine-protein kinase Chk1 [2-280]
Ligand
BDBM91831
Substrate
Meas. Tech.
33P-Radiometric_Method1
Ki
57.9±n/a nM
Citation
 D3R, DD Abbott CHK1 Kinase D3R 221:0 (2015) Target
Name:
Serine/threonine-protein kinase Chk1 [2-280]
Synonyms:
CHEK1 CHK1_HUMAN | CHK1_Kinase
Type:
Mol. Mass.:
32109.16
Organism:
Homo sapiens (Human)
Description:
O14757[2-280]
Residue:
279
  
Inhibitor
Name:
BDBM91831
Synonyms:
Chk1_105
Type:
Emp. Form.:
C21H23ClN6O5
Mol. Mass.:
474.898
SMILES:
COc1cc(NC(=O)CCCCCCC(O)=O)c(Cl)cc1NC(=O)Nc1cnc(cn1)C#N
: