Target
Serine/threonine-protein kinase Chk1 [2-280]
Ligand
BDBM91859
Substrate
Meas. Tech.
33P-Radiometric_Method1
Ki
5.17±n/a nM
Citation
 D3R, DD Abbott CHK1 Kinase D3R 221:0 (2015) Target
Name:
Serine/threonine-protein kinase Chk1 [2-280]
Synonyms:
CHEK1 CHK1_HUMAN | CHK1_Kinase
Type:
Mol. Mass.:
32109.16
Organism:
Homo sapiens (Human)
Description:
O14757[2-280]
Residue:
279
  
Inhibitor
Name:
BDBM91859
Synonyms:
Chk1_136
Type:
Emp. Form.:
C27H22N4O6
Mol. Mass.:
498.4868
SMILES:
COc1cc2NC(=O)c3ccc(cc3Nc2cc1OCc1ccncc1)-c1ccc(c(OC)c1)[N+]([O-])=O
: