Target
Mitogen-activated protein kinase 1
Ligand
BDBM92097
Substrate
Meas. Tech.
Photometric_Method2
Ki
3±n/a nM
Citation
 D3R, DD Vertex ERK2 D3R 222:0 (2015) Target
Name:
Mitogen-activated protein kinase 1
Synonyms:
ERK2 Extracellular signal-regulated kinase 2 Extracellular signal-regulated kinase 2 (ERK2) MAPK 2 MK01_HUMAN Mitogen-activated protein kinase 1 (ERK-2) Mitogen-activated protein kinase 2 PRKM2 | p42-MAPK
Type:
Ser/Thr Protein Kinase
Mol. Mass.:
41392.76
Organism:
Homo sapiens (Human)
Description:
P28482
Residue:
360
  
Inhibitor
Name:
BDBM92097
Synonyms:
erk000527
Type:
Emp. Form.:
C25H25N5O3
Mol. Mass.:
443.4977
SMILES:
Cc1cnc(Nc2cccc(O)c2C)nc1-c1c[nH]c(c1)C(=O)N[C@H](CO)c1ccccc1
: