Target
Mitogen-activated protein kinase 1
Ligand
BDBM92191
Substrate
Meas. Tech.
Photometric_Method2
Ki
4±n/a nM
Citation
 D3R, DD Vertex ERK2 D3R 222:0 (2015) Target
Name:
Mitogen-activated protein kinase 1
Synonyms:
ERK2 Extracellular signal-regulated kinase 2 Extracellular signal-regulated kinase 2 (ERK2) MAPK 2 MK01_HUMAN Mitogen-activated protein kinase 1 (ERK-2) Mitogen-activated protein kinase 2 PRKM2 | p42-MAPK
Type:
Ser/Thr Protein Kinase
Mol. Mass.:
41392.76
Organism:
Homo sapiens (Human)
Description:
P28482
Residue:
360
  
Inhibitor
Name:
BDBM92191
Synonyms:
erk000647
Type:
Emp. Form.:
C21H22F3N5O2
Mol. Mass.:
433.4269
SMILES:
Cc1cccc(c1)[C@@H](CO)NC(=O)c1cc(c[nH]1)-c1nc(NCC(F)(F)F)ncc1C
: