Target
Mitogen-activated protein kinase 1
Ligand
BDBM92236
Substrate
Meas. Tech.
Photometric_Method2
Ki
3±n/a nM
Citation
 D3R, DD Vertex ERK2 D3R 222:0 (2015) Target
Name:
Mitogen-activated protein kinase 1
Synonyms:
ERK2 Extracellular signal-regulated kinase 2 Extracellular signal-regulated kinase 2 (ERK2) MAPK 2 MK01_HUMAN Mitogen-activated protein kinase 1 (ERK-2) Mitogen-activated protein kinase 2 PRKM2 | p42-MAPK
Type:
Ser/Thr Protein Kinase
Mol. Mass.:
41392.76
Organism:
Homo sapiens (Human)
Description:
P28482
Residue:
360
  
Inhibitor
Name:
BDBM92236
Synonyms:
erk000704
Type:
Emp. Form.:
C23H27N5O3
Mol. Mass.:
421.4922
SMILES:
Cc1cnc(N[C@H]2CCOC2)nc1-c1cc(C(=O)N[C@H](CO)c2ccccc2)n(C)c1
: