Target
Malate synthase G [C619A]
Ligand
BDBM50174491
Substrate
Meas. Tech.
DNTB-Coupled_Enzyme_Assay
IC50
180±n/a nM
Citation
 D3R, DD Sacchettini GlcB D3R 223:0 (2015) Target
Name:
Malate synthase G [C619A]
Synonyms:
MASZ_MYCTO | glcB
Type:
Mol. Mass.:
80350.85
Organism:
Mycobacterium tuberculosis (strain CDC 1551 / Oshkosh)
Description:
P9WK16[C619A]
Residue:
741
  
Inhibitor
Name:
BDBM50174491
Synonyms:
(Z)-2-Hydroxy-4-oxo-4-m-tolyl-but-2-enoic acid Sacchettini_5
Type:
Small organic molecule
Emp. Form.:
C11H10O4
Mol. Mass.:
206.1947
SMILES:
Cc1cccc(c1)C(=O)CC(=O)C(O)=O
: