Target
Malate synthase G [C619A]
Ligand
BDBM225393
Substrate
Meas. Tech.
DNTB-Coupled_Enzyme_Assay
IC50
>100000±n/a nM
Citation
 D3R, DD Sacchettini GlcB D3R 223:0 (2015) Target
Name:
Malate synthase G [C619A]
Synonyms:
MASZ_MYCTO | glcB
Type:
Mol. Mass.:
80350.85
Organism:
Mycobacterium tuberculosis (strain CDC 1551 / Oshkosh)
Description:
P9WK16[C619A]
Residue:
741
  
Inhibitor
Name:
BDBM225393
Synonyms:
Sacchettini_20
Type:
Small Organic Molecule
Emp. Form.:
C13H14O4
Mol. Mass.:
234.2479
SMILES:
CC(C)c1ccccc1C(=O)\C=C(/O)C(O)=O
: