Target
Tyrosine-protein kinase SYK [355-635]
Ligand
BDBM225466
Substrate
Meas. Tech.
SYK assay_HTRF
IC50
793±n/a nM
Citation
 D3R, DD GSK SYK Kinase D3R 225:0 (2015) Target
Name:
Tyrosine-protein kinase SYK [355-635]
Synonyms:
KSYK_HUMAN SYK Kinase
Type:
Mol. Mass.:
32610.83
Organism:
Homo sapiens (Human)
Description:
P43405[355-635]
Residue:
281
  
Inhibitor
Name:
BDBM225466
Synonyms:
GTC000175A
Type:
Small Organic Molecule
Emp. Form.:
C20H19N7O
Mol. Mass.:
373.4112
SMILES:
CN(C(C)=O)c1ccc(Nc2nccc(Nc3cccc4[nH]ncc34)n2)cc1
: