Target
Tyrosine-protein kinase SYK [355-635]
Ligand
BDBM225470
Substrate
Meas. Tech.
SYK assay_HTRF
IC50
4159±n/a nM
Citation
 D3R, DD GSK SYK Kinase D3R 225:0 (2015) Target
Name:
Tyrosine-protein kinase SYK [355-635]
Synonyms:
KSYK_HUMAN SYK Kinase
Type:
Mol. Mass.:
32610.83
Organism:
Homo sapiens (Human)
Description:
P43405[355-635]
Residue:
281
  
Inhibitor
Name:
BDBM225470
Synonyms:
GTC000179A
Type:
Small Organic Molecule
Emp. Form.:
C22H23N7O2S
Mol. Mass.:
449.529
SMILES:
O=S(=O)(N1CCCCC1)c1cccc(Nc2nccc(Nc3cccc4[nH]ncc34)n2)c1
: