Target
Tyrosine-protein kinase SYK [355-635]
Ligand
BDBM225485
Substrate
Meas. Tech.
SYK assay_HTRF
IC50
1644±n/a nM
Citation
 D3R, DD GSK SYK Kinase D3R 225:0 (2015) Target
Name:
Tyrosine-protein kinase SYK [355-635]
Synonyms:
KSYK_HUMAN SYK Kinase
Type:
Mol. Mass.:
32610.83
Organism:
Homo sapiens (Human)
Description:
P43405[355-635]
Residue:
281
  
Inhibitor
Name:
BDBM225485
Synonyms:
GTC000194A
Type:
Small Organic Molecule
Emp. Form.:
C23H24N6O3
Mol. Mass.:
432.4751
SMILES:
CC(C)(C)OC(=O)COc1ccc(Nc2nccc(Nc3cccc4[nH]ncc34)n2)cc1
: