Target
Tyrosine-protein kinase SYK [355-635]
Ligand
BDBM225511
Substrate
Meas. Tech.
SYK assay_HTRF
IC50
916±n/a nM
Citation
 D3R, DD GSK SYK Kinase D3R 225:0 (2015) Target
Name:
Tyrosine-protein kinase SYK [355-635]
Synonyms:
KSYK_HUMAN SYK Kinase
Type:
Mol. Mass.:
32610.83
Organism:
Homo sapiens (Human)
Description:
P43405[355-635]
Residue:
281
  
Inhibitor
Name:
BDBM225511
Synonyms:
GTC000220A
Type:
Small Organic Molecule
Emp. Form.:
C24H21N7O2S
Mol. Mass.:
471.534
SMILES:
Cc1ccc(cc1)S(=O)(=O)Nc1ccc(Nc2nccc(Nc3cccc4[nH]ncc34)n2)cc1
: