Target
Tyrosine-protein kinase SYK [355-635]
Ligand
BDBM225528
Substrate
Meas. Tech.
SYK assay_HTRF
IC50
1.87±n/a nM
Citation
 D3R, DD GSK SYK Kinase D3R 225:0 (2015) Target
Name:
Tyrosine-protein kinase SYK [355-635]
Synonyms:
KSYK_HUMAN SYK Kinase
Type:
Mol. Mass.:
32610.83
Organism:
Homo sapiens (Human)
Description:
P43405[355-635]
Residue:
281
  
Inhibitor
Name:
BDBM225528
Synonyms:
GTC000234A
Type:
Small Organic Molecule
Emp. Form.:
C25H27FN8O2
Mol. Mass.:
490.5327
SMILES:
Cc1nn(CCCO)c2cc(Nc3ncc(F)c(n3)N(CCCO)c3cccc4[nH]ncc34)ccc12
: