Target
Tyrosine-protein kinase SYK [355-635]
Ligand
BDBM225530
Substrate
Meas. Tech.
SYK assay_HTRF
IC50
4.88±n/a nM
Citation
 D3R, DD GSK SYK Kinase D3R 225:0 (2015) Target
Name:
Tyrosine-protein kinase SYK [355-635]
Synonyms:
KSYK_HUMAN SYK Kinase
Type:
Mol. Mass.:
32610.83
Organism:
Homo sapiens (Human)
Description:
P43405[355-635]
Residue:
281
  
Inhibitor
Name:
BDBM225530
Synonyms:
GTC000236A
Type:
Small Organic Molecule
Emp. Form.:
C22H23N7O3S
Mol. Mass.:
465.528
SMILES:
COCCCN(c1ccnc(Nc2ccc3CNS(=O)(=O)c3c2)n1)c1cccc2[nH]ncc12
: