Target
Tyrosine-protein kinase SYK [355-635]
Ligand
BDBM225531
Substrate
Meas. Tech.
SYK assay_HTRF
IC50
3.76±n/a nM
Citation
 D3R, DD GSK SYK Kinase D3R 225:0 (2015) Target
Name:
Tyrosine-protein kinase SYK [355-635]
Synonyms:
KSYK_HUMAN SYK Kinase
Type:
Mol. Mass.:
32610.83
Organism:
Homo sapiens (Human)
Description:
P43405[355-635]
Residue:
281
  
Inhibitor
Name:
BDBM225531
Synonyms:
GTC000237A | GTC000237B
Type:
Small Organic Molecule
Emp. Form.:
C20H17FN8O
Mol. Mass.:
404.4004
SMILES:
CCN(c1cccc2[nH]ncc12)c1nc(Nc2ccc3[nH]c(=O)[nH]c3c2)ncc1F
: