Target
Tyrosine-protein kinase SYK [355-635]
Ligand
BDBM225562
Substrate
Meas. Tech.
SYK assay_HTRF
IC50
9.27±n/a nM
Citation
 D3R, DD GSK SYK Kinase D3R 225:0 (2015) Target
Name:
Tyrosine-protein kinase SYK [355-635]
Synonyms:
KSYK_HUMAN SYK Kinase
Type:
Mol. Mass.:
32610.83
Organism:
Homo sapiens (Human)
Description:
P43405[355-635]
Residue:
281
  
Inhibitor
Name:
BDBM225562
Synonyms:
GTC000266A GTC000266C
Type:
Small Organic Molecule
Emp. Form.:
C22H21FN8O
Mol. Mass.:
432.4535
SMILES:
Cn1ncc2ccc(Nc3ncc(F)c(n3)N(CCCO)c3cccc4[nH]ncc34)cc12
: