Target
Bile acid receptor
Ligand
BDBM225942
Substrate
Meas. Tech.
Scintillation Proximity Assay (SPA)
pH
7.4±n/a
IC50
67.500000±n/a nM
Comments
extracted
Citation
 D3R, DD Drug Design Data Resource Grand Challenge 2 Dataset: FXR - Farnesoid X Receptor D3R 882:0 (2017) Target
Name:
Bile acid receptor
Synonyms:
BAR FXR HRR1 NR1H4_HUMAN RIP14 Retinoid X receptor-interacting protein 14 | farnesoid x receptor
Type:
Nuclear Receptor
Mol. Mass.:
55916.24
Organism:
Homo sapiens (Human)
Description:
Q96RI1
Residue:
486
  
Inhibitor
Name:
BDBM225942
Synonyms:
FXR_32
Type:
Small Organic Molecule
Emp. Form.:
C29H35F2N3O3
Mol. Mass.:
511.6033
SMILES:
CO[C@@H](c1nc2cc(F)c(F)cc2n1[C@@H](C1CCCCC1)C(=O)N[C@H]1CC[C@H](O)CC1)c1ccccc1
: