Target
Bile acid receptor
Ligand
BDBM225943
Substrate
Meas. Tech.
Scintillation Proximity Assay (SPA)
pH
7.4±n/a
IC50
45±n/a nM
Comments
extracted
Citation
 D3R, DD Drug Design Data Resource Grand Challenge 2 Dataset: FXR - Farnesoid X Receptor D3R 882:0 (2017) Target
Name:
Bile acid receptor
Synonyms:
BAR FXR HRR1 NR1H4_HUMAN RIP14 Retinoid X receptor-interacting protein 14 | farnesoid x receptor
Type:
Nuclear Receptor
Mol. Mass.:
55916.24
Organism:
Homo sapiens (Human)
Description:
Q96RI1
Residue:
486
  
Inhibitor
Name:
BDBM225943
Synonyms:
FXR_33
Type:
Small Organic Molecule
Emp. Form.:
C29H25Cl2N3O5
Mol. Mass.:
566.432
SMILES:
CC(C)c1onc(c1COc1ccc(c(C)c1)-c1ccc2c(cn(C)c2c1)C(O)=O)-c1c(Cl)c[n+]([O-])cc1Cl
: