Target
Coagulation factor X
Ligand
BDBM226018
Substrate
Meas. Tech.
D3R246
IC50
6.53±n/a nM
Citation
 D3R, DD GSK FactorXA-2 D3R 246:0 (2015) Target
Name:
Coagulation factor X
Synonyms:
Activated coagulation factor X (FXa) Coagulation factor X precursor F10 Factor X heavy chain Factor Xa Stuart-Prower factor
Type:
Enzyme
Mol. Mass.:
54726.60
Organism:
Homo sapiens (Human)
Description:
Residue:
488
  
Inhibitor
Name:
BDBM226018
Synonyms:
GTC000003A
Type:
Small Organic Molecule
Emp. Form.:
C23H25ClN4O5S
Mol. Mass.:
504.986
SMILES:
C[C@H](N1CC[C@H](N(CC#N)S(=O)(=O)c2ccc3cc(Cl)ccc3c2)C1=O)C(=O)N1CCOCC1
: